{"text_format":"1","workbook":"xlsx","n_sheets":16,"sheets":["GARDE","SOMMAIRE","recap","Graphe magasin","graphe pole","masque","POINTS DIRECTEURS","RECEPTION","Zone commune","RETRAIT","FRUIT ET LEGUMES","EPICERIE","POISSON","PLS BOUCHERIE","technique","liste"],"not_rendered":{"charts":11,"images":0,"macros":1,"external_links":3,"defined_names":34,"comments":0,"pivot_tables":0},"unopened":[],"bounds":{"document_bytes":16777216,"sheet_cells":100000,"rows_first":2000,"rows_last":500,"rows_between":2000,"halvings":0,"cell_chars":16384,"cell_head_chars":4096},"cells_cut":0,"cells_raw":0,"read":"whole","date_system":"1900"}

{"sheet":"GARDE","index":0,"n_rows":52,"n_cols":7,"rows_kept":52,"cut":false,"hidden":false,"merged":[[48,4,50,6],[51,4,53,6]]}
[]
[]
[]
[]
[]
[]
[]
[]
[]
[]
{"$rows_left_out":43}
{"sheet":"SOMMAIRE","index":1,"n_rows":16,"n_cols":2,"rows_kept":16,"cut":false,"hidden":false,"merged":[]}
[]
["SOMMAIRE"]
[]
[null,"Récapitulatif des notes"]
[null,"Récapitulatif des objectifs"]
[null,"Evolution de la note globale hygiène et du % de réalisation plans d'action "]
[null,"Evolution des notes par Pôle"]
[null,"Réception"]
[null,"Zone Commune"]
[null,"Retrait / Alerte"]
{"$rows_left_out":7}
{"sheet":"recap","index":2,"n_rows":55,"n_cols":13,"rows_kept":55,"cut":false,"hidden":false,"merged":[[13,6,16,6],[9,6,12,6],[41,6,44,6],[53,9,53,10],[54,9,54,10],[17,6,20,6],[54,7,54,8],[33,6,36,6],[37,6,40,6],[53,7,53,8],[21,6,24,6],[25,6,28,6],[29,6,32,6]]}
[]
[]
[]
[]
[]
[]
[null,null,null,null,null,null,null,"Visites","V1","V2","V3","V4","V5"]
[null,null,null,null,null,null,null,null,"Note ","Note","Note","Note","Note"]
[null,null,null,null,null,null,null,"Date de la visite ",{"$f":"IFERROR(masque!AU21,\"\")","v":"2017-02-17"},{"$f":"IFERROR(masque!CD21,\"\")","v":"2017-06-14"},{"$f":"IFERROR(masque!CE21,\"\")","v":"00:00:00"},{"$f":"IFERROR(masque!CF21,\"\")","v":"00:00:00"},{"$f":"IFERROR(masque!CG21,\"\")","v":"00:00:00"}]
[null,null,null,null,null,null,"RECEPTION","Note sur 100",{"$f":"IF(masque!AU22=\"\",\"\",masque!AU22)","v":0.28570000000000001},{"$f":"IF(masque!AT22=\"\",\"\",masque!AT22)","v":0.5357142857142857},{"$f":"IF(masque!AS22=\"\",\"\",masque!AS22)","v":""},{"$f":"IF(masque!AR22=\"\",\"\",masque!AR22)","v":""},{"$f":"IF(masque!AQ22=\"\",\"\",masque!AQ22)","v":""}]
{"$rows_left_out":46}
{"sheet":"Graphe magasin","index":3,"n_rows":0,"n_cols":0,"rows_kept":0,"cut":false,"hidden":false,"merged":[]}

{"sheet":"graphe pole","index":4,"n_rows":0,"n_cols":0,"rows_kept":0,"cut":false,"hidden":true,"merged":[]}

{"sheet":"masque","index":5,"n_rows":226,"n_cols":85,"rows_kept":226,"cut":false,"hidden":false,"merged":[]}
[null,null,null,null,null,null,null,null,"Note Rayon",null,"Accompagnateur","Rayons","Constat",null,null,null,"max F","max T","global",null,"Rapport CM El Menzah 9122013",null,"Checklist CM Houmet Souk011900"]
[{"$f":"$AP$22","v":0.58620689655172409},null,null,null,null,null,null,null,0.53569999999999995,null,"Moncef SMAOUI","RECEPTION","NOK",null,null,"REC",{"$f":"SUM(IF((BDRayon=$P2)*(FouS=\"F\")*(RIGHT(Constat,2)=\"OK\"),SiOk))","v":27},{"$f":"SUM(IF((BDRayon=$P2)*(FouS=\"S\")*(RIGHT(Constat,2)=\"OK\"),SiOk))","v":2},{"$f":"+Q2+R2","v":29}]
[null,null,null,null,null,null,null,null,1,null,"dir magasin","RETRAIT / ALERTE",null,null,null,"RET",{"$f":"SUM(IF((BDRayon=$P3)*(FouS=\"F\")*(RIGHT(Constat,2)=\"OK\"),SiOk))","v":8},{"$f":"SUM(IF((BDRayon=$P3)*(FouS=\"S\")*(RIGHT(Constat,2)=\"OK\"),SiOk))","v":0},{"$f":"+Q3+R3","v":8}]
[null,null,null,null,null,null,null,null,0.81820000000000004,null,"Ahmed ben Salem","POISSON",null,null,null,"POI",{"$f":"SUM(IF((BDRayon=$P4)*(FouS=\"F\")*(RIGHT(Constat,2)=\"OK\"),SiOk))","v":37},{"$f":"SUM(IF((BDRayon=$P4)*(FouS=\"S\")*(RIGHT(Constat,2)=\"OK\"),SiOk))","v":13},50]
[null,null,null,"Masque de saisie audit d'un magasin Carrefour Tunisie",null,null,null,null,0.77080000000000004,null,"slama nizar","FRUITS ET LEGUMES/OLIVES EPICES",null,null,null,"FRL",{"$f":"SUM(IF((BDRayon=$P5)*(FouS=\"F\")*(RIGHT(Constat,2)=\"OK\"),SiOk))","v":40},{"$f":"SUM(IF((BDRayon=$P5)*(FouS=\"S\")*(RIGHT(Constat,2)=\"OK\"),SiOk))","v":8},48]
[null,null,null,null,null,null,null,null,0.6552,null,"Hamza BRAIEK","EPICERIE /LIQUIDES",null,null,null,"EPL",{"$f":"SUM(IF((BDRayon=$P6)*(FouS=\"F\")*(RIGHT(Constat,2)=\"OK\"),SiOk))","v":20},{"$f":"SUM(IF((BDRayon=$P6)*(FouS=\"S\")*(RIGHT(Constat,2)=\"OK\"),SiOk))","v":5},25]
[null,null,null,null,null,null,null,null,0.78080000000000005,null,"Brahim brongi","PLS/BOUCHERIE",null,null,null,"PBO",{"$f":"SUM(IF((BDRayon=$P7)*(FouS=\"F\")*(RIGHT(Constat,2)=\"OK\"),SiOk))","v":45},{"$f":"SUM(IF((BDRayon=$P7)*(FouS=\"S\")*(RIGHT(Constat,2)=\"OK\"),SiOk))","v":14},59]
[null,null,null,"Pas toucher aux zones grisées",null,null,null,null,0.83330000000000004,null,"dir magasin","POINTS DIRECTEURS",null,null,null,"PDR",{"$f":"SUM(IF((BDRayon=$P8)*(FouS=\"F\")*(RIGHT(Constat,2)=\"OK\"),SiOk))","v":14},{"$f":"SUM(IF((BDRayon=$P8)*(FouS=\"S\")*(RIGHT(Constat,2)=\"OK\"),SiOk))","v":0},14]
[null,null,null,null,null,null,null,null,0.56520000000000004,null,"aymen Salah","ZONE COMMUNE",null,null,null,"ZOM",{"$f":"SUM(IF((BDRayon=$P9)*(FouS=\"F\")*(RIGHT(Constat,2)=\"OK\"),SiOk))","v":16},{"$f":"SUM(IF((BDRayon=$P9)*(FouS=\"S\")*(RIGHT(Constat,2)=\"OK\"),SiOk))","v":13},29]
[null,null,null,null,null,null,null,null,0.45450000000000002,null,"aymen Salah","SERVICE TECHNIQUE",null,null,null,"TEC",{"$f":"SUM(IF((BDRayon=$P10)*(FouS=\"F\")*(RIGHT(Constat,2)=\"OK\"),SiOk))","v":0},{"$f":"SUM(IF((BDRayon=$P10)*(FouS=\"S\")*(RIGHT(Constat,2)=\"OK\"),SiOk))","v":22},22]
{"$rows_left_out":217}
{"sheet":"POINTS DIRECTEURS","index":6,"n_rows":22,"n_cols":10,"rows_kept":22,"cut":false,"hidden":false,"merged":[[21,4,21,5]]}
[null,{"$f":"\"Accompagné par :  \" &masque!K8","v":"Accompagné par :  dir magasin"},null,"POINTS DIRECTEURS",null,null,null,null,"PDR"]
[null,null,null,null,"Visite "]
[null,null,null,"Visite",{"$f":"masque!$E$11","v":"V2"}]
[null,null,null,"Date",{"$f":"masque!$E$12","v":"2017-06-14"}]
[null,null,null,"Heure"]
[null,null,"Pénalités","Base",null,null,"Non-conformité","Action corrective","Fixé le","Responsable"]
["011.","POINTS DIRECTEURS",null,null,"F","T"]
["0111.",{"$f":"masque!L182","v":"Armoire à pharmacie conforme"},{"$f":"masque!M182","v":-2},{"$f":"masque!N182","v":2},{"$f":"masque!P182","v":2},"NA",{"$f":"IF(masque!Q182=0,\"\",masque!Q182)","v":""},{"$f":"IF(masque!R182=0,\"\",masque!R182)","v":""},{"$f":"IF(masque!S182=0,\"\",masque!S182)","v":""},{"$f":"IF(masque!T182=0,\"\",masque!T182)","v":""}]
["0112a",{"$f":"masque!L183","v":"Présence de la réglementation en vigueur"},{"$f":"masque!M183","v":-2},{"$f":"masque!N183","v":2},{"$f":"masque!P183","v":2},"NA",{"$f":"IF(masque!Q183=0,\"\",masque!Q183)","v":""},{"$f":"IF(masque!R183=0,\"\",masque!R183)","v":""},{"$f":"IF(masque!S183=0,\"\",masque!S183)","v":""},{"$f":"IF(masque!T183=0,\"\",masque!T183)","v":""}]
["0112b",{"$f":"masque!L184","v":"Classement des dossiers de retrait"},{"$f":"masque!M184","v":-1},{"$f":"masque!N184","v":1},{"$f":"masque!P184","v":1},"NA",{"$f":"IF(masque!Q184=0,\"\",masque!Q184)","v":""},{"$f":"IF(masque!R184=0,\"\",masque!R184)","v":""},{"$f":"IF(masque!S184=0,\"\",masque!S184)","v":""},{"$f":"IF(masque!T184=0,\"\",masque!T184)","v":""}]
{"$rows_left_out":13}
{"sheet":"RECEPTION","index":7,"n_rows":35,"n_cols":11,"rows_kept":35,"cut":false,"hidden":false,"merged":[[0,3,0,6],[2,5,2,6],[3,5,3,6],[34,5,34,6]]}
[{"$f":"\"Accompagné par :  \" &masque!K2","v":"Accompagné par :  Moncef SMAOUI"},null,null,"RECEPTION",null,null,null,"REC"]
[null,null,"2011-05-13",null,null,null,"Visite "]
[null,null,null,null,"Visite",{"$f":"masque!$E$11","v":"V2"}]
[null,null,null,null,"Date",{"$f":"masque!$E$12","v":"2017-06-14"}]
[null,null,null,null,"Heure"]
[null,null,null,"Pénalités","Base",null,null,"Non-conformité","Action corrective","Fixé le","Responsable"]
["01.","RECEPTION",null,null,null,"F","T"]
["011",{"$f":"masque!L26","v":"Présence et bon fonctionnement du thermomètre à sonde et infrarouge "},{"$f":"masque!M26","v":-2},{"$f":"masque!M26","v":-2},{"$f":"masque!N26","v":2},{"$f":"masque!P26","v":0},"NA",{"$f":"IF(masque!Q26=0,\"\",masque!Q26)","v":"Absence de thermomètre à infra rouge. Achat en cours.+S38Q24:S44Q24:T164"},{"$f":"IF(masque!R26=0,\"\",masque!R26)","v":"Prévoir un thermomètre infra rouge."},{"$f":"IF(masque!S26=0,\"\",masque!S26)","v":"2013-10-23"},{"$f":"IF(masque!T26=0,\"\",masque!T26)","v":"Moncef SMAOUI"}]
["012",{"$f":"masque!L27","v":"Thermomètre rangé avec son matériel de désinfection"},null,{"$f":"masque!M27","v":-1},{"$f":"masque!N27","v":1},{"$f":"masque!P27","v":0},"NA",{"$f":"IF(masque!Q27=0,\"\",masque!Q27)","v":"Absence de  matériel de désinfection"},{"$f":"IF(masque!R27=0,\"\",masque!R27)","v":"Prévoir du matériel de désinfection"},{"$f":"IF(masque!S27=0,\"\",masque!S27)","v":"2013-10-23"},{"$f":"IF(masque!T27=0,\"\",masque!T27)","v":""}]
["013",{"$f":"masque!L28","v":"Réalisation de la vérification  mensuelle du thermomètre"},null,{"$f":"masque!M28","v":-1},{"$f":"masque!N28","v":1},{"$f":"masque!P28","v":0},"NA",{"$f":"IF(masque!Q28=0,\"\",masque!Q28)","v":"L'enregistrement de suivi est réalisé mais le protocole n'est pas maitrisé; "},{"$f":"IF(masque!R28=0,\"\",masque!R28)","v":"Une sensibilisation sur cet écart a eu lieu le jour de l'audit."},{"$f":"IF(masque!S28=0,\"\",masque!S28)","v":"2017-06-14"},{"$f":"IF(masque!T28=0,\"\",masque!T28)","v":""}]
{"$rows_left_out":26}
{"sheet":"Zone commune","index":8,"n_rows":34,"n_cols":11,"rows_kept":34,"cut":false,"hidden":false,"merged":[[33,5,33,6]]}
[{"$f":"\"Accompagné par :  \" &masque!K9","v":"Accompagné par :  aymen Salah"},null,"ZONE COMMUNE"]
[null,null,null,null,null,"Visite "]
[null,null,null,null,"Visite",{"$f":"masque!$E$11","v":"V2"}]
[null,null,null,null,"Date",{"$f":"masque!$E$12","v":"2017-06-14"}]
[null,null,null,null,"Heure"]
[null,null,null,null,"Base",null,null,"Non-conformité","Action corrective","Fixé le","Responsable"]
["03.","INTERIEURS ET CORRIDORS",null,null,null,"F","T"]
["031",{"$f":"masque!L190","v":"Absence d'entreposage sauvage "},null,{"$f":"masque!M190","v":-2},{"$f":"masque!N190","v":2},{"$f":"masque!P190","v":0},"NA",{"$f":"IF(masque!Q190=0,\"\",masque!Q190)","v":"Présence  des oiseaux au niveau de la réserve sèche et surface de vente"},{"$f":"IF(masque!R190=0,\"\",masque!R190)","v":"Renforcer la lutte contre les nuisibles."},{"$f":"IF(masque!S190=0,\"\",masque!S190)","v":"2017-02-17"},{"$f":"IF(masque!T190=0,\"\",masque!T190)","v":"aymen Salah"}]
["033",{"$f":"masque!L191","v":"Absence de nuisible"},null,{"$f":"masque!M191","v":-2},{"$f":"masque!N191","v":2},{"$f":"masque!P191","v":2},"NA",{"$f":"IF(masque!Q191=0,\"\",masque!Q191)","v":""},{"$f":"IF(masque!#REF!=0,\"\",masque!#REF!)","v":{"$error":"#REF!"}},{"$f":"IF(masque!S191=0,\"\",masque!S191)","v":""},{"$f":"IF(masque!T191=0,\"\",masque!T191)","v":""}]
["034",{"$f":"masque!L192","v":"Propreté des intérieurs / corridors"},null,{"$f":"masque!M192","v":-1},{"$f":"masque!N192","v":1},{"$f":"masque!P192","v":1},"NA",{"$f":"IF(masque!Q192=0,\"\",masque!Q192)","v":""},{"$f":"IF(masque!R192=0,\"\",masque!R192)","v":""},{"$f":"IF(masque!S192=0,\"\",masque!S192)","v":""},{"$f":"IF(masque!T192=0,\"\",masque!T192)","v":""}]
{"$rows_left_out":25}
{"sheet":"RETRAIT","index":9,"n_rows":26,"n_cols":11,"rows_kept":26,"cut":false,"hidden":false,"merged":[[0,3,0,5],[25,5,25,6]]}
[{"$f":"\"Accompagné par :  \" &masque!K3","v":"Accompagné par :  dir magasin"},null,null,"RETRAIT / ALERTE",null,null,null,"RET"]
[null,null,null,null,null,"Visite "]
[null,null,null,null,"Visite",{"$f":"masque!$E$11","v":"V2"}]
[null,null,null,null,"Date",{"$f":"masque!$E$12","v":"2017-06-14"}]
[null,null,null,null,"Heure"]
[null,null,null,"Pénalités","Base",null,null,"Non-conformité","Action corrective","Fixé le","Responsable"]
["030.","RETRAIT / ALERTE",null,null,null,"F","T"]
[300,{"$f":"masque!L44","v":"Existence d'un classeur Alertes / Retraits et de la procédure "},null,{"$f":"masque!M44","v":-5},{"$f":"masque!N44","v":2},{"$f":"masque!P44","v":2},"NA",{"$f":"IF(masque!Q44=0,\"\",masque!Q44)","v":""},{"$f":"IF(masque!R44=0,\"\",masque!R44)","v":""},null,{"$f":"IF(masque!T44=0,\"\",masque!T44)","v":""}]
["072.",{"$f":"masque!L45","v":"Connaisance et affichage de la procédure de retrait \n"},null,{"$f":"masque!M45","v":-5},{"$f":"masque!N45","v":2},{"$f":"masque!P45","v":2},"NA",{"$f":"IF(masque!Q45=0,\"\",masque!Q45)","v":""},{"$f":"IF(masque!R45=0,\"\",masque!R45)","v":""},null,{"$f":"IF(masque!T45=0,\"\",masque!T45)","v":""}]
["0301.",{"$f":"masque!L46","v":"Existence de zones de consignation"},null,{"$f":"masque!M46","v":-2},{"$f":"masque!N46","v":2},{"$f":"masque!P46","v":2},"NA",{"$f":"IF(masque!Q46=0,\"\",masque!Q46)","v":""},{"$f":"IF(masque!R46=0,\"\",masque!R46)","v":""},null,{"$f":"IF(masque!T46=0,\"\",masque!T46)","v":""}]
{"$rows_left_out":17}
{"sheet":"FRUIT ET LEGUMES","index":10,"n_rows":44,"n_cols":10,"rows_kept":44,"cut":false,"hidden":false,"merged":[[43,4,43,5]]}
[{"$f":"\"Accompagné par :  \" &masque!K5","v":"Accompagné par :  slama nizar"},null,null,"FRUITS ET LEGUMES/OLIVES EPICES",null,null,null,"FRL"]
[null,null,null,null,"Visite "]
[null,null,null,"Visite",{"$f":"masque!$E$11","v":"V2"}]
[null,null,null,"Date",{"$f":"masque!$E$12","v":"2017-06-14"}]
[null,null,null,"Heure"]
[null,null,"Pénalités","Base",null,null,"Non-conformité","Action corrective","Fixé le","Responsable"]
["18.","POLE",null,null,"F","T"]
[181,{"$f":"masque!L93","v":"Linéaires propres."},{"$f":"masque!M93","v":-5},{"$f":"masque!N93","v":2},{"$f":"masque!P93","v":2},"NA",{"$f":"IF(masque!Q93=0,\"\",masque!Q93)","v":""},{"$f":"IF(masque!R93=0,\"\",masque!R93)","v":""},{"$f":"IF(masque!S93=0,\"\",masque!S93)","v":""},{"$f":"IF(masque!T93=0,\"\",masque!T93)","v":""}]
[182,{"$f":"masque!L95","v":"Entretien et propreté des sols, plinthes, murs plafonds, portes satisfaisants"},{"$f":"masque!M94","v":-5},{"$f":"masque!N94","v":2},{"$f":"masque!P94","v":2},{"$f":"masque!P95","v":2},{"$f":"IF(masque!Q94=0,IF(masque!Q95=0,\"\",\"  S : \"&masque!Q95),IF(masque!Q95=0,\"F: \"&masque!Q94,\"F: \"&masque!Q94&\"//    S : \"&masque!Q95))","v":""},{"$f":"IF(masque!R94=0,IF(masque!R95=0,\"\",\"  S : \"&masque!R95),IF(masque!R95=0,\"F: \"&masque!R94,\"F: \"&masque!R94&\"//    S : \"&masque!R95))","v":""},{"$f":"IF(masque!S94=0,IF(masque!S95=0,\"\",\"  S : \"&masque!S95),IF(masque!S95=0,\"F: \"&masque!S94,\"F: \"&masque!S94&\"//    S : \"&masque!S95))","v":""},{"$f":"IF(masque!T94=0,IF(masque!T95=0,\"\",\"  S : \"&masque!T95),IF(masque!T95=0,\"F: \"&masque!T94,\"F: \"&masque!T94&\"//    S : \"&masque!T95))","v":"  S : "}]
[null,"Suivi des autocontrôles de nettoyage",{"$f":"masque!M96","v":-1},{"$f":"masque!N96","v":1},{"$f":"masque!P96","v":0},"NA",{"$f":"IF(masque!Q96=0,\"\",masque!Q96)","v":"Absence de séparation dans le temps pour la sortie des produits casse à partir de la CF FLEG. "},{"$f":"IF(masque!R96=0,\"\",masque!R96)","v":"Fixer les horaires de sortie des produits casse (passant par les chambres froides.)"},{"$f":"IF(masque!S96=0,\"\",masque!S96)","v":""},{"$f":"IF(masque!T96=0,\"\",masque!T96)","v":""}]
{"$rows_left_out":35}
{"sheet":"EPICERIE","index":11,"n_rows":34,"n_cols":16,"rows_kept":34,"cut":false,"hidden":false,"merged":[[0,8,0,10],[31,0,31,7],[32,0,32,7],[33,10,33,11]]}
[{"$f":"\"Accompagné par :  \" &masque!K6","v":"Accompagné par :  Hamza BRAIEK"},null,null,null,null,null,null,null,"EPICERIE /LIQUIDES",null,null,null,"EPI"]
[null,null,null,null,null,null,null,null,null,null,"Visite "]
[null,null,null,null,null,null,null,null,null,"Visite",{"$f":"masque!$E$11","v":"V2"}]
[null,null,null,null,null,null,null,null,null,"Date",{"$f":"masque!$E$12","v":"2017-06-14"}]
[null,null,null,null,null,null,null,null,null,"Heure"]
[null,null,null,null,null,null,null,null,"Pénalités","Base",null,null,"Non-conformité","Action corrective","Fixé le","Responsable"]
["11.","RESERVE",null,null,null,null,null,null,null,null,"F","T"]
[112,{"$f":"masque!L121","v":"Réserve propre et rangée."},{"$f":"masque!M121","v":-5},{"$f":"masque!N121","v":2},{"$f":"masque!O121","v":"OK"},{"$f":"masque!P121","v":2},{"$f":"masque!Q121","v":0},{"$f":"masque!R128","v":"Eliminer les boites de conserve rouillées."},{"$f":"masque!M121","v":-5},{"$f":"masque!N121","v":2},{"$f":"masque!P121","v":2},"NA",{"$f":"IF(masque!Q121=0,\"\",masque!Q121)","v":""},{"$f":"IF(masque!R128=0,\"\",masque!R128)","v":"Eliminer les boites de conserve rouillées."},{"$f":"IF(masque!S128=0,\"\",masque!S128)","v":"2017-06-14"},{"$f":"IF(masque!T121=0,\"\",masque!T121)","v":""}]
[113,{"$f":"masque!L122","v":"Zone de retour produit balisée"},null,null,null,null,null,null,{"$f":"masque!M122","v":-2},{"$f":"masque!N122","v":2},{"$f":"masque!P122","v":0},"NA",{"$f":"IF(masque!Q122=0,\"\",masque!Q122)","v":"Entreposage des sacs de farine sur des palettes en bois abimées\n"},{"$f":"IF(masque!R122=0,\"\",masque!R122)","v":"Utiliser des palettes en bois en bon état."},{"$f":"IF(masque!S122=0,\"\",masque!S122)","v":""},{"$f":"IF(masque!T122=0,\"\",masque!T122)","v":"Hamza BRAIEK"}]
[114,{"$f":"masque!L123","v":"Absence de stockage au sol"},"nb produit",null,null,null,null,null,{"$f":"masque!M123","v":-1},{"$f":"masque!N123","v":1},{"$f":"masque!P123","v":0},"NA",{"$f":"IF(masque!Q123=0,\"\",masque!Q123)","v":"Stockage du lait dans le couloir destiné à l'entreposage des produits casse (couloir derrière les chambres froides). \n"},{"$f":"IF(masque!R123=0,\"\",masque!R123)","v":"Stocker le lait dans la zone de stockage des liquides.\n"},{"$f":"IF(masque!S123=0,\"\",masque!S123)","v":"2017-06-14"},{"$f":"IF(masque!T123=0,\"\",masque!T123)","v":"Hamza BRAIEK"}]
{"$rows_left_out":25}
{"sheet":"POISSON","index":12,"n_rows":63,"n_cols":10,"rows_kept":63,"cut":false,"hidden":false,"merged":[[62,4,62,5]]}
[null,null,"POISSON",null,null,null,null,"POI"]
[null,null,null,null,"Visite "]
[{"$f":"\"Accompagné par :  \" &masque!K4","v":"Accompagné par :  Ahmed ben Salem"},null,null,"Visite",{"$f":"masque!$E$11","v":"V2"}]
[null,null,null,"Date",{"$f":"masque!$E$12","v":"2017-06-14"}]
[null,null,null,"Heure"]
[null,null,"Décote","Base",null,null,"Non-conformité","Action corrective","Fixé le","Responsable"]
[null,"POLE",null,null,"F","T"]
[null,{"$f":"masque!L48","v":"Equipement propre (table. Balance, Caisse)"},{"$f":"masque!M48","v":-2},{"$f":"masque!N48","v":2},{"$f":"masque!P48","v":2},"NA",{"$f":"IF(masque!Q48=0,\"\",masque!Q48)","v":"\n"},{"$f":"IF(masque!R48=0,\"\",masque!R48)","v":""},{"$f":"IF(masque!S48=0,\"\",masque!S48)","v":""},{"$f":"IF(masque!T48=0,\"\",masque!T48)","v":""}]
[null,{"$f":"masque!L50","v":"Entretien et propreté des sols, plinthes, murs plafonds, portes satisfaisants"},{"$f":"masque!M49","v":-5},{"$f":"masque!N49","v":2},{"$f":"masque!P49","v":2},{"$f":"masque!P50","v":-3},{"$f":"IF(masque!Q49=0,IF(masque!Q50=0,\"\",\"  S : \"&masque!Q50),IF(masque!Q50=0,\"F: \"&masque!Q49,\"F: \"&masque!Q49&\"//    S : \"&masque!Q50))","v":"  S : \nPrésence de fuite d'eau au niveau de l'évier."},{"$f":"IF(masque!R49=0,IF(masque!R50=0,\"\",\"  S : \"&masque!R50),IF(masque!R50=0,\"F: \"&masque!R49,\"F: \"&masque!R49&\"//    S : \"&masque!R50))","v":"  S : Réparer la fuite"},{"$f":"IF(masque!S49=0,IF(masque!S50=0,\"\",\"  S : \"&masque!S50),IF(masque!S50=0,\"F: \"&masque!S49,\"F: \"&masque!S49&\"//    S : \"&masque!S50))","v":"  S : 42900"},{"$f":"IF(masque!T49=0,IF(masque!T50=0,\"\",\"  S : \"&masqueT47),IF(masque!T50=0,\"F: \"&masque!T49,\"F: \"&masque!T49&\"//    S : \"&masque!T50))","v":"F: //    S : Ahmed ben Salem"}]
[null,{"$f":"masque!L52","v":"Entretien et propreté des évacuations au sol satisfaisants"},{"$f":"masque!M51","v":-1},{"$f":"masque!N51","v":1},{"$f":"masque!P51","v":1},{"$f":"masque!P52","v":1},{"$f":"IF(masque!Q51=0,IF(masque!Q52=0,\"\",\"  S : \"&masque!Q52),IF(masque!Q52=0,\"F: \"&masque!Q51,\"F: \"&masque!Q51&\"//    S : \"&masque!Q52))","v":""},{"$f":"IF(masque!R51=0,IF(masque!R52=0,\"\",\"  S : \"&masque!R52),IF(masque!R52=0,\"F: \"&masque!R51,\"F: \"&masque!R51&\"//    S : \"&masque!R52))","v":""},{"$f":"IF(masque!S51=0,IF(masque!S52=0,\"\",\"  S : \"&masque!S52),IF(masque!S52=0,\"F: \"&masque!S51,\"F: \"&masque!S51&\"//    S : \"&masque!S52))","v":""},{"$f":"IF(masque!T51=0,IF(masque!T52=0,\"\",\"  S : \"&masqueT49),IF(masque!T52=0,\"F: \"&masque!T51,\"F: \"&masque!T51&\"//    S : \"&masque!T52))","v":"F: //    S : "}]
{"$rows_left_out":54}
{"sheet":"PLS BOUCHERIE","index":13,"n_rows":65,"n_cols":10,"rows_kept":65,"cut":false,"hidden":false,"merged":[[64,4,64,5]]}
[{"$f":"\"Accompagné par :  \" &masque!K7","v":"Accompagné par :  Brahim brongi"},null,null,"PLS/BOUCHERIE",null,null,null,"PLS"]
[null,null,null,null,"Visite "]
[null,null,null,"Visite",{"$f":"masque!$E$11","v":"V2"}]
[null,null,null,"Date",{"$f":"masque!$E$12","v":"2017-06-14"}]
[null,null,null,"Heure"]
[null,null,"Pénalités","Base",null,null,"Non-conformité","Action corrective","Fixé le","Responsable"]
[11,"CHAMBRE FROIDE PLS",null,null,"F","T"]
[111,{"$f":"masque!L136","v":"Température adaptée (+4°C)"},{"$f":"masque!M136","v":-1},{"$f":"masque!N136","v":1},{"$f":"masque!P136","v":"NA"},"NA",{"$f":"IF(masque!Q136=0,\"\",masque!Q136)","v":""},{"$f":"IF(masque!R136=0,\"\",masque!R136)","v":""},{"$f":"IF(masque!S136=0,\"\",masque!S136)","v":""},{"$f":"IF(masque!T136=0,\"\",masque!T136)","v":""}]
[null,{"$f":"masque!L138","v":"Propreté et entretien de la chambre froide satisfaisant Sols, évacuations, Murs, plafonds, portes, Etagères"},{"$f":"masque!M137","v":-5},{"$f":"masque!N137","v":2},{"$f":"masque!P137","v":"NA"},{"$f":"masque!P138","v":"NA"},{"$f":"IF(masque!Q137=0,IF(masque!Q138=0,\"\",\"  S : \"&masque!Q138),IF(masque!Q138=0,\"F: \"&masque!Q137,\"F: \"&masque!Q137&\"//    S : \"&masque!Q138))","v":""},{"$f":"IF(masque!R137=0,IF(masque!R138=0,\"\",\"  S : \"&masque!R138),IF(masque!R138=0,\"F: \"&masque!R137,\"F: \"&masque!R137&\"//    S : \"&masque!R138))","v":""},{"$f":"IF(masque!S137=0,IF(masque!S138=0,\"\",\"  S : \"&masque!S138),IF(masque!S138=0,\"F: \"&masque!S137,\"F: \"&masque!S137&\"//    S : \"&masque!S138))","v":""},{"$f":"IF(masque!T137=0,IF(masque!T138=0,\"\",\"  S : \"&masque!T138),IF(masque!T138=0,\"F: \"&masque!T137,\"F: \"&masque!T137&\"//    S : \"&masque!T138))","v":"  S : "}]
["112b",{"$f":"masque!L139","v":"Rangement satisfaisant"},{"$f":"masque!M139","v":-1},{"$f":"masque!N139","v":1},{"$f":"masque!P139","v":"NA"},"NA",{"$f":"IF(masque!Q139=0,\"\",masque!Q139)","v":""},{"$f":"IF(masque!R139=0,\"\",masque!R139)","v":""},{"$f":"IF(masque!S139=0,\"\",masque!S139)","v":""},{"$f":"IF(masque!T139=0,\"\",masque!T139)","v":""}]
{"$rows_left_out":56}
{"sheet":"technique","index":14,"n_rows":43,"n_cols":10,"rows_kept":43,"cut":false,"hidden":false,"merged":[[42,4,42,5]]}
[{"$f":"\"Accompagné par :  \" &masque!K10","v":"Accompagné par :  aymen Salah"},null,null,"SERVICE TECHNIQUE",null,null,null,"TEC"]
[null,null,null,null,"Visite "]
[null,null,null,"Visite",{"$f":"masque!$E$11","v":"V2"}]
[null,null,null,"Date",{"$f":"masque!$E$12","v":"2017-06-14"}]
[null,null,null,"Heure"]
[null,null,"Pénalités","Base",null,null,"Non-conformité","Action corrective","Fixé le","Responsable"]
[6,"MAITRISE DU FROID",null,null,"F","T"]
["62c",{"$f":"masque!L208","v":"Présence / bon fonctionnement thermoenregistreurs pole Poisson"},{"$f":"masque!M208","v":-1},{"$f":"masque!N208","v":1},"NA",{"$f":"masque!P208","v":1},{"$f":"IF(masque!Q208=0,\"\",masque!Q208)","v":""},{"$f":"IF(masque!R208=0,\"\",masque!R208)","v":""},{"$f":"IF(masque!S208=0,\"\",masque!S208)","v":""},{"$f":"IF(masque!T208=0,\"\",masque!T208)","v":""}]
["62f",{"$f":"masque!L209","v":"Présence / bon fonctionnement thermoenregistreurs pole Fruits et Légumes"},{"$f":"masque!M209","v":-1},{"$f":"masque!N209","v":1},"NA",{"$f":"masque!P209","v":1},{"$f":"IF(masque!Q209=0,\"\",masque!Q209)","v":""},{"$f":"IF(masque!R209=0,\"\",masque!R209)","v":""},{"$f":"IF(masque!S209=0,\"\",masque!S209)","v":""},{"$f":"IF(masque!T209=0,\"\",masque!T209)","v":""}]
["62j",{"$f":"masque!L210","v":"Présence / bon fonctionnement thermoenregistreurs pole PLS/boucherie"},{"$f":"masque!M210","v":-1},{"$f":"masque!N210","v":1},"NA",{"$f":"masque!P210","v":0},{"$f":"IF(masque!Q210=0,\"\",masque!Q210)","v":"La GTC est en panne."},{"$f":"IF(masque!R210=0,\"\",masque!R210)","v":"Réparer la GTC."},{"$f":"IF(masque!S210=0,\"\",masque!S210)","v":""},{"$f":"IF(masque!T210=0,\"\",masque!T210)","v":""}]
{"$rows_left_out":34}
{"sheet":"liste","index":15,"n_rows":6,"n_cols":6,"rows_kept":6,"cut":false,"hidden":true,"merged":[]}
["Visite",{"$f":"MATCH(masque!E11,listvisit)","v":2},{"$f":"IF(B1=1,2,1)","v":1},{"$f":"C1+1","v":2},{"$f":"D1+1","v":3},5]
["V1"]
["V2"]
["V3"]
["V4"]
["V5"]